{"text_format":"1","workbook":"xlsx","n_sheets":3,"sheets":["Inizio","Elenco residui","Campionamento"],"not_rendered":{"charts":0,"images":0,"macros":1,"external_links":0,"defined_names":1,"comments":0,"pivot_tables":0},"unopened":[],"bounds":{"document_bytes":16777216,"sheet_cells":100000,"rows_first":2000,"rows_last":500,"rows_between":2000,"halvings":0,"cell_chars":16384,"cell_head_chars":4096},"cells_cut":0,"cells_raw":0,"read":"whole","date_system":"1900"}

{"sheet":"Inizio","index":0,"n_rows":32,"n_cols":5,"rows_kept":32,"cut":false,"hidden":false,"merged":[]}
[null,null,null,null,"BOZZA PER LA PUBBLICA CONSULTAZIONE"]
[]
[null,"Società","Ente ABC",null,"Fase 1 - Informazioni sull’oggetto di analisi"]
[null,"Esercizio in corso","20XX",null,"Nome del conto/voce di bilancio"]
[null,"Esercizio precedente","20XX-1",null,"Data di copertura"]
[null,"Data di chiusura","31/12/20XX",null,"Livello di significatività operativa assegnata alla posta"]
[null,null,null,null,"Descrizione dell’approccio di campionamento"]
[null,"Team di revisione",null,null,"Fase 2 - Definizione della popolazione"]
[null,"Presidente","P",null,"Ammontare complessivo della popolazione oggetto di analisi"]
[null,"Revisore","M1",null,"(indicare valore o numero items)"]
[null,"Revisore","M2",null,"Identificazione del report da testare"]
[null,"Ausiliario","A",null,"Unità oggetto del test"]
[null,"Collaboratore","C",null,"Verifiche svolte per accertare che la popolazione sia appropriata e completa"]
[null,null,null,null,"Operazioni eventualmente non testate in quanto individualmente significative"]
[null,null,null,null,"Ammontare delle operazioni fuori campione perché individualmente significative"]
[null,null,null,null,"Fase 3 - Definizione dell’errore"]
[null,null,null,null,"Identificazione di cosa si qualifichi come errore"]
[null,null,null,null,"Fase 4 – Scelta del metodo di campionamento"]
[null,null,null,null,"4.1 Campionamento non statistico"]
[null,null,null,null,"Metodo di selezione del campione"]
[null,null,null,null,"Metodo di selezione delle unità da testare"]
[null,null,null,null,"Numero unità testate"]
[null,null,null,null,"Valore/Numero complessivo unità testate"]
[null,null,null,null,"4.2 Campionamento statistico"]
[null,null,null,null,"Valore massimo tollerabile di errore"]
[null,null,null,null,"Livello di riduzione del rischio cercato (basso, medio, alto)"]
[null,null,null,null,"Livello % e conseguente fattore di confidenza"]
[null,null,null,null,"Numero di operazioni da testare "]
[null,null,null,null,"(Saldo non testato*Fattore di confidenza/significatività)"]
[null,null,null,null,"Metodo di selezione del campione"]
[null,null,null,null,"Metodo di selezione delle unità da testare"]
[null,null,null,null,"Fase 5 – Valutazione dei risultati"]

{"sheet":"Elenco residui","index":1,"n_rows":585,"n_cols":5,"rows_kept":585,"cut":false,"hidden":false,"merged":[[7,1,7,4]]}
[null,"Carta di lavoro"]
[null,"Elenco residui attivi"]
[]
[null,"Preparata da: P/M1/M2","Data: _________________","Cliente",{"$f":"Inizio!$C$3","v":"Ente ABC"}]
[null,"Rivista da: M1/M2/P","Data: _________________","Data bilancio",{"$f":"Inizio!$C$6","v":"31/12/20XX"}]
[null,"Rivista da: M2/P/M1","Data: _________________","Data documento",{"$f":"TODAY()","v":"2020-06-09"}]
[]
[null,"Partitario clienti"]
[]
[null,"N. cap. residuo - codice bilancio","Descrizione","Importo"]
[null,"1.01.01.53.001","SALDO IMPOSTA COMUNALE PUBBLICITA' E AGGIO ANNO 2016",3710.9]
[null,"1.01.01.08.001","RECUPREO ICI AREE FABBRICABILI",0]
[null,"1.01.01.08.001 000",null,0]
[null,"1.01.01.08.001 000",null,3386.17]
[null,"1.01.01.08.001 000",null,54916]
[null,"1.01.01.08.001 000",null,51897]
[null,"1.01.01.08.001 000",null,31481.9]
[null,"1.01.01.06.001",null,127514.11]
[null,"1.01.01.08.002",null,97295]
[null,"1.01.01.08.002",null,22801]
[null,"1.01.01.08.002",null,25193]
[null,"1.01.01.08.002",null,81045]
[null,"1.01.01.08.002",null,103373]
[null,"1.01.01.08.002",null,82839]
[null,"1.01.01.08.002",null,53421.01]
[null,"1.01.01.08.002",null,50992]
[null,"1.01.01.08.002",null,11853]
[null,"1.01.01.08.002",null,19407]
[null,"1.01.01.08.002",null,93762]
[null,"1.01.01.08.002",null,369018]
[null,"1.01.01.08.002",null,300000]
[null,"1.01.01.08.002",null,138984]
[null,"1.01.01.08.002",null,112120]
[null,"1.01.01.08.002",null,147019]
[null,"1.01.01.08.002",null,170000]
[null,"1.01.01.08.002",null,140000]
[null,"1.01.01.08.002",null,8403]
[null,"1.01.01.08.002",null,5568]
[null,"1.01.01.08.002",null,69440]
[null,"1.01.01.08.002",null,21855]
[null,"1.01.01.16.001",null,321548.75]
[null,"1.01.01.52.001",null,9107.2099999999991]
[null,"1.01.01.61.001",null,1557548.98]
[null,"1.01.01.61.001",null,2200238.2000000002]
[null,"1.01.01.53.001",null,5773]
[null,"2.01.01.01.001",null,372179.98]
[null,"2.01.01.01.001",null,13784.55]
[null,"2.01.01.01.001",null,41266.69]
[null,"2.01.01.01.001",null,185267.17]
[null,"2.01.01.01.002",null,93551.67]
[null,"2.01.01.01.001",null,42438.11]
[null,"2.01.01.01.001",null,426.08]
[null,"2.01.01.02.001",null,35000]
[null,"2.01.01.02.001",null,20370]
[null,"2.01.01.02.001",null,20000]
[null,"2.01.01.02.001",null,124689.92]
[null,"2.01.01.02.001",null,421351]
[null,"2.01.01.02.001",null,15000]
[null,"2.01.01.02.001",null,225888.11]
[null,"2.01.01.02.001",null,1000]
[null,"2.01.01.02.001",null,3806.64]
[null,"2.01.01.02.001",null,89000]
[null,"2.01.01.02.001",null,35400]
[null,"2.01.01.02.001",null,25000]
[null,"2.01.01.02.001",null,57192.43]
[null,"2.01.01.02.001",null,92535]
[null,"2.01.01.02.001",null,10693.79]
[null,"2.01.01.02.001",null,15301.5]
[null,"2.01.01.02.001",null,97000]
[null,"2.01.01.02.001",null,10000]
[null,"2.01.01.02.001",null,11244.1]
[null,"2.01.01.02.002",null,35184.65]
[null,"2.01.04.01.001",null,175582]
[null,"2.01.01.04.001",null,59531.32]
[null,"2.01.01.04.001",null,199442.41]
[null,"3.01.02.01.032",null,159.63999999999999]
[null,"3.01.02.01.032",null,3518.97]
[null,"3.01.02.01.032",null,315.82]
[null,"3.01.02.01.032",null,389.51]
[null,"3.01.02.01.033",null,1723.44]
[null,"3.02.01.01.001",null,104.3]
[null,"3.02.01.01.001",null,1043]
[null,"3.02.01.01.001",null,726.82]
[null,"3.02.01.01.001",null,971]
[null,"3.02.01.01.001",null,2070.5]
[null,"3.02.01.01.001",null,876.9]
[null,"3.02.01.01.001",null,1204]
[null,"3.02.01.01.001",null,3003.2]
[null,"3.02.01.01.001",null,346.4]
[null,"3.02.01.01.001",null,300]
[null,"3.02.01.01.001",null,104.3]
[null,"3.02.01.01.001",null,164478.14000000001]
[null,"3.02.01.01.001",null,244736.62]
[null,"3.02.01.01.001",null,290570.12]
[null,"3.02.01.01.001",null,31118.21]
[null,"3.01.02.01.020",null,18558.3]
[null,"3.01.02.01.014",null,506.17]
[null,"3.01.02.01.014",null,712.77]
[null,"3.01.02.01.999",null,248873.67]
[null,"3.01.02.01.999",null,555800.46]
[null,"3.01.02.01.999",null,215123.87]
[null,"3.01.02.01.999",null,260]
[null,"3.01.02.01.018",null,250]
[null,"3.01.02.01.018",null,250]
[null,"3.01.02.01.018",null,60]
[null,"3.01.02.01.018",null,2020]
[null,"3.01.02.01.018",null,120]
[null,"3.01.02.01.018",null,180]
[null,"3.01.02.01.018",null,150]
[null,"3.01.02.01.018",null,650]
[null,"3.01.02.01.018",null,150]
[null,"3.01.02.01.018",null,350]
[null,"3.01.02.01.018",null,175]
[null,"3.01.02.01.018",null,480]
[null,"3.01.02.01.018",null,15]
[null,"3.01.02.01.018",null,450]
[null,"3.01.02.01.018",null,120]
[null,"3.01.02.01.018",null,120]
[null,"3.01.02.01.018",null,150]
[null,"3.01.02.01.018",null,150]
[null,"3.01.02.01.018",null,150]
[null,"3.01.02.01.018",null,150]
[null,"3.01.02.01.018",null,5000]
[null,"3.01.02.01.018",null,150]
[null,"3.01.02.01.018",null,325]
[null,"3.01.02.01.018",null,175]
[null,"3.01.02.01.999",null,170]
[null,"3.01.02.01.013",null,80]
[null,"3.01.02.01.999",null,600]
[null,"3.01.02.01.999",null,300]
[null,"3.01.02.01.999",null,120]
[null,"3.01.02.01.999",null,190]
[null,"3.01.02.01.999",null,300]
[null,"3.01.02.01.999",null,100]
[null,"3.01.02.01.999",null,60]
[null,"3.01.02.01.999",null,150]
[null,"3.01.02.01.999",null,150]
[null,"3.01.02.01.018",null,60]
[null,"3.01.02.01.018",null,100]
[null,"3.01.02.01.018",null,200]
[null,"3.01.02.01.018",null,1150]
[null,"3.01.02.01.018",null,60]
[null,"3.01.02.01.018",null,60]
[null,"3.01.02.01.018",null,350]
[null,"3.01.02.01.018",null,1200]
[null,"3.01.02.01.018",null,120]
[null,"3.01.02.01.018",null,100]
[null,"3.01.02.01.018",null,120]
[null,"3.05.99.99.999",null,2070.25]
[null,"3.05.99.99.003",null,2070.25]
[null,"3.01.03.02.002",null,3456]
[null,"3.01.03.02.002",null,750]
[null,"3.01.03.02.002",null,360]
[null,"3.01.03.02.003",null,326.74]
[null,"3.01.03.02.003",null,457.6]
[null,"3.01.03.02.003",null,43301.83]
[null,"3.01.03.02.003",null,1152]
[null,"3.01.03.02.002",null,1978.78]
[null,"3.01.03.02.002",null,210]
[null,"3.01.03.02.002",null,3456]
[null,"3.01.03.02.002",null,360]
[null,"3.01.03.02.002",null,3456]
[null,"3.01.03.02.002",null,750]
[null,"3.01.03.01.003",null,3615]
[null,"3.01.03.01.003",null,297]
[null,"3.01.03.01.003",null,624.84]
[null,"3.01.03.01.003",null,413]
[null,"3.01.03.01.003",null,421.4]
[null,"3.01.03.01.003",null,1500]
[null,"3.01.03.01.003",null,300]
[null,"3.01.03.01.003",null,1122]
[null,"3.01.03.01.003",null,840]
[null,"3.01.03.01.003",null,1600]
[null,"3.01.03.01.003",null,952.2]
[null,"3.01.03.01.003",null,698]
[null,"3.01.03.01.003",null,2711.3]
[null,"3.01.03.01.003",null,297]
[null,"3.01.03.01.003",null,318.88]
[null,"3.01.03.01.003",null,698]
[null,"3.01.03.01.003",null,3615]
[null,"3.01.03.01.003",null,297]
[null,"3.01.03.01.003",null,392.8]
[null,"2.01.03.01.999",null,67000]
[null,"3.05.99.99.999",null,3000]
[null,"3.05.99.99.999",null,7440]
[null,"3.05.99.99.999",null,2500]
[null,"3.05.99.99.999",null,3220]
[null,"3.05.99.99.999",null,3500]
[null,"3.05.99.99.999",null,610]
[null,"3.05.99.99.999",null,220]
[null,"3.05.99.99.999",null,1220]
[null,"3.05.99.99.999",null,12810]
[null,"3.05.99.99.999",null,3660]
[null,"3.01.02.01.999",null,3797.56]
[null,"3.01.02.01.999",null,3939.83]
[null,"3.05.99.99.999",null,8116.03]
[null,"3.05.99.99.999",null,3283.62]
[null,"3.05.99.99.999",null,2004]
[null,"3.05.99.99.999",null,334.21]
[null,"3.05.99.99.999",null,114.18]
[null,"3.05.99.99.999",null,4815.4799999999996]
[null,"3.05.99.99.999",null,7297.44]
[null,"3.05.99.99.999",null,222.1]
[null,"3.05.99.99.999",null,885.78]
[null,"3.05.99.99.999",null,10000]
[null,"3.05.99.99.999",null,13950]
[null,"3.05.99.99.999",null,1183.4000000000001]
[null,"3.05.99.99.999",null,8164.89]
[null,"3.05.99.99.999",null,4409.4399999999996]
[null,"3.05.99.99.999",null,4573.3900000000003]
[null,"3.05.99.99.999",null,4209.54]
[null,"3.05.99.99.999",null,22]
[null,"3.05.99.99.999",null,33]
[null,"3.05.99.99.999",null,7916.03]
[null,"3.05.99.99.999",null,9954]
[null,"3.05.99.99.999",null,3188.42]
[null,"3.05.99.99.999",null,3380.67]
[null,"3.05.99.99.999",null,10457.719999999999]
[null,"3.05.99.99.999",null,80.02]
[null,"3.05.99.99.999",null,12.33]
[null,"3.05.99.99.999",null,476.95]
[null,"3.05.99.99.999",null,427.94]
[null,"3.05.99.99.999",null,7000]
[null,"3.05.99.99.999",null,8331.52]
[null,"3.05.99.99.999",null,2586.91]
[null,"3.05.99.99.999",null,8450]
[null,"3.05.02.02.003",null,20203]
[null,"3.01.02.01.002",null,12799.38]
[null,"3.01.02.01.002",null,11787.82]
[null,"3.05.99.99.999",null,196]
[null,"3.01.02.01.008",null,5000]
[null,"3.01.02.01.016",null,1690]
[null,"3.05.99.99.999",null,30390.63]
[null,"3.05.99.99.999",null,336.09]
[null,"3.05.99.99.999",null,1195.02]
[null,"3.01.02.01.999",null,1500]
[null,"3.01.02.01.999",null,5210.55]
[null,"3.01.02.01.999",null,4782.42]
[null,"3.01.03.02.003",null,1586.36]
[null,"3.01.03.02.003",null,2113.7800000000002]
[null,"4.04.01.08.999",null,1100000]
[null,"4.04.01.08.999",null,4727.4799999999996]
[null,"4.04.01.08.999",null,366000]
[null,"4.04.02.01.999",null,56324.67]
[null,"4.04.01.08.007",null,1628258.96]
[null,"4.05.01.01.001",null,60000]
[null,"4.05.01.01.001",null,1444.65]
[null,"4.05.01.01.001",null,36217.279999999999]
[null,"4.05.01.01.001",null,1873.4]
[null,"4.05.01.01.001",null,5.86]
[null,"4.05.01.01.001",null,4451.7]
[null,"4.02.01.01.001",null,15905]
[null,"4.02.01.01.001",null,65000]
[null,"4.02.01.01.001",null,200000]
[null,"4.02.01.01.001",null,646753.28000000003]
[null,"4.02.01.01.001",null,1518920.9]
[null,"4.02.01.02.001",null,30000]
[null,"4.02.01.02.001",null,520000]
[null,"4.02.01.02.001",null,540000]
[null,"4.02.01.02.001",null,400000]
[null,"4.02.01.02.001",null,25000]
[null,"4.02.01.02.001",null,5600.13]
[null,"4.03.01.02.001",null,649650]
[null,"4.02.01.02.001",null,71958.14]
[null,"4.02.01.02.001",null,150000]
[null,"4.02.01.02.001",null,400288.89]
[null,"4.02.01.02.001",null,26731.94]
[null,"4.02.01.02.001",null,68968.800000000003]
[null,"4.02.01.02.001",null,2660249]
[null,"4.02.01.02.001",null,70000]
[null,"5.04.07.01.001",null,196857.21]
[null,"5.04.07.01.001",null,285000]
[null,"5.04.07.01.001",null,492697.66]
[null,"5.04.07.01.001",null,200000]
[null,"6.03.01.04.003",null,88616.84]
[null,"6.03.01.04.003",null,1314492.8799999999]
[null,"6.03.01.04.003",null,576567.11]
[null,"6.03.01.04.003",null,183000]
[null,"6.03.01.04.003",null,196857.21]
[null,"6.03.01.04.003",null,285000]
[null,"6.03.01.04.003",null,492697.66]
[null,"6.03.01.04.003",null,100000]
[null,"6.03.01.04.003",null,40000]
[null,"6.03.01.04.003",null,150000]
[null,"6.03.01.04.003",null,95689.42]
[null,"6.03.01.04.003",null,33911.58]
[null,"6.03.01.04.003",null,104059.59]
[null,"6.03.01.04.003",null,14793.91]
[null,"6.03.01.04.003",null,99569.34]
[null,"6.03.01.04.003",null,375.82]
[null,"6.03.01.04.003",null,200000]
[null,"6.03.01.04.003",null,350000]
[null,"6.03.01.04.003",null,28043.05]
[null,"6.03.01.04.003",null,27343.8]
[null,"6.03.01.04.003",null,92098.1]
[null,"9.01.02.02.001",null,460.2]
[null,"9.01.02.01.001",null,2004.87]
[null,"9.02.04.01.001",null,812.95]
[null,"9.02.04.01.001",null,1050]
[null,"9.02.04.01.001",null,178.15]
[null,"9.02.99.99.999",null,120]
[null,"9.02.99.99.999",null,131.86000000000001]
[null,"9.02.99.99.999",null,248.6]
[null,"9.02.99.99.999",null,32331.67]
[null,"9.02.99.99.999",null,121.88]
[null,"9.02.99.99.999",null,12000]
[null,"9.02.99.99.999",null,12000]
[null,"9.02.99.99.999",null,306.98]
[null,"9.02.99.99.999",null,1158.5899999999999]
[null,"9.02.99.99.999",null,5951.16]
[null,"9.02.99.99.999",null,611.16999999999996]
[null,"9.02.99.99.999",null,16551.599999999999]
[null,"9.02.99.99.999",null,10390.94]
[null,"9.02.99.99.999",null,4589.8999999999996]
[null,"9.02.99.99.999",null,17692.189999999999]
[null,"9.02.99.99.999",null,4057.79]
[null,"9.02.99.99.999",null,6086.82]
[null,"9.02.99.99.999",null,6776]
[null,null,null," "]
[]
[]
[]
[]
[]
[]
[]
[]
[]
[]
[]
[]
[]
[]
[]
[]
[]
[]
[]
[]
[]
[]
[]
[]
[]
[]
[]
[]
[]
[]
[]
[]
[]
[]
[]
[]
[]
[]
[]
[]
[]
[]
[]
[]
[]
[]
[]
[]
[]
[]
[]
[]
[]
[]
[]
[]
[]
[]
[]
[]
[]
[]
[]
[]
[]
[]
[]
[]
[]
[]
[]
[]
[]
[]
[]
[]
[]
[]
[]
[]
[]
[]
[]
[]
[]
[]
[]
[]
[]
[]
[]
[]
[]
[]
[]
[]
[]
[]
[]
[]
[]
[]
[]
[]
[]
[]
[]
[]
[]
[]
[]
[]
[]
[]
[]
[]
[]
[]
[]
[]
[]
[]
[]
[]
[]
[]
[]
[]
[]
[]
[]
[]
[]
[]
[]
[]
[]
[]
[]
[]
[]
[]
[]
[]
[]
[]
[]
[]
[]
[]
[]
[]
[]
[]
[]
[]
[]
[]
[]
[]
[]
[]
[]
[]
[]
[]
[]
[]
[]
[]
[]
[]
[]
[]
[]
[]
[]
[]
[]
[]
[]
[]
[]
[]
[]
[]
[]
[]
[]
[]
[]
[]
[]
[]
[]
[]
[]
[]
[]
[]
[]
[]
[]
[]
[]
[]
[]
[]
[]
[]
[]
[]
[]
[]
[]
[]
[]
[]
[]
[]
[]
[]
[]
[]
[]
[]
[]
[]
[]
[]
[]
[]
[]
[]
[]
[]
[]
[]
[]
[]
[]
[]
[]
[]
[]
[]
[]
[]
[]
[]
[]
[]
[]
[]
[]
[]
[]
[]
[]
[]
[]
[]
[]
[]
[]
[null,null,null,{"$f":"SUM(D11:D584)","v":28365856.380000003}]

{"sheet":"Campionamento","index":2,"n_rows":350,"n_cols":13,"rows_kept":350,"cut":false,"hidden":false,"merged":[[6,1,6,8],[1,1,1,3],[0,1,0,2],[7,11,7,12]]}
[null,"Carta di lavoro"]
[null,"Campionamento dei residui attivi",null,null,null,null,null,null,"F 100.4"]
[null,"Cliente",{"$f":"Inizio!$C$3","v":"Ente ABC"},null,null,null,null,"Preparata da: P/M1/M2","Data: _________________"]
[null,"Data bilancio",{"$f":"Inizio!$C$6","v":"31/12/20XX"},null,null,null,null,"Rivista da: M1/M2/P","Data: _________________"]
[null,"Data documento",{"$f":"TODAY()","v":"2020-06-09"},null,null,null,null,"Rivista da: M2/P/M1","Data: _________________"]
[]
[null,"Campionamento dei residui attivi"]
[null,null,null,null,null,null,null,null,null,null,null,"RICONCILIAZIONE DELLA SELEZIONE"]
[null,"Saldo del conto",null,{"$f":"SUM('Elenco residui'!D11:D318)","v":28365856.380000003},null,null,"Fattore correttivo",null,{"$f":"IF(D13=\"Basso\",1,IF(D13=\"Medio\",2,3))","v":1},null,null,"Valore casuale iniziale",{"$f":"-I11","v":241027}]
[null,"Significatività operativa","75% della significatività complessiva pari al 2% del parametro \"entrate correnti\" (30.123.106 x 2% = 602.462 significativà complessiva)  (602.462 x 75% = 451.487 significatività operativa)",451847,null,null,"Intervallo di selezione",null,{"$f":"D10/I9","v":451847},null,null,"Numero Items selezionati x intervallo di selezione",{"$f":"(I10*F17)","v":28466361}]
[null,"Rischio intrinseco",null,"Basso",{"$f":"IF(D11=\"Alto\",2,1)","v":1},null,"Numero casuale",null,-241027,null,null,"Resto finale",{"$f":"I326","v":-341531.62000000034}]
[null,"Rischio controllo",null,"Basso",{"$f":"IF(D12=\"Basso\",1,2)","v":1},null,null,null,null,null,null,"Somma ",{"$f":"SUM(M9:M11)","v":28365856.379999999}]
[null,"Rischio individuazione",null,{"$f":"IF(AND(E11=1,E12=1),\"Basso\",IF(AND(E11=2,E12=1),\"Medio\",IF(AND(E11=2,E12=2),\"Alto\",IF(AND(E11=1,E12=2),\"Medio\",))))","v":"Basso"},null,null,null,null,null,"Basso","Basso","Somma popolazione residui",{"$f":"D9","v":28365856.380000003}]
[]
[]
[]
[null,null,null,null,null,{"$f":"SUM(F19:F326)","v":63},{"$f":"COUNTIF(G24:G302,\"Sì\")","v":42}]
[null,"N. capitolo Bilancio","Descrizione","Saldo di conto","Sub-Totale","Selezione","Selezionato","Intervallo","Resto"," "]
[null,20180000001,{"$f":"'Elenco residui'!C11","v":"SALDO IMPOSTA COMUNALE PUBBLICITA' E AGGIO ANNO 2016"},{"$f":"'Elenco residui'!D11-'Elenco residui'!E11","v":3710.9},{"$f":"D19+I11","v":-237316.1},{"$f":"IF(E19>0,ROUND(E19/H19+0.5,0),0)","v":0},{"$f":"IF(F19=0,\"No\",\"Sì\")","v":"No"},{"$f":"$I$10","v":451847},{"$f":"E19-(F19*H19)","v":-237316.1}]
[null,20180000002,{"$f":"'Elenco residui'!C12","v":"RECUPREO ICI AREE FABBRICABILI"},{"$f":"'Elenco residui'!D12-'Elenco residui'!E12","v":0},{"$f":"D20+I19","v":-237316.1},0,{"$f":"IF(F20=0,\"No\",\"Sì\")","v":"No"},451847,-237316.1]
[null,20180000003,{"$f":"'Elenco residui'!C13","v":0},{"$f":"'Elenco residui'!D13-'Elenco residui'!E13","v":0},-237316.1,0,"No",451847,-237316.1,null,null," "]
[null,20180000004,{"$f":"'Elenco residui'!C14","v":0},{"$f":"'Elenco residui'!D14-'Elenco residui'!E14","v":3386.17},-233929.93,0,"No",451847,-233929.93]
[null,20180000005,{"$f":"'Elenco residui'!C15","v":0},{"$f":"'Elenco residui'!D15-'Elenco residui'!E15","v":54916},-179013.93,0,"No",451847,-179013.93]
[null,20180000006,{"$f":"'Elenco residui'!C16","v":0},{"$f":"'Elenco residui'!D16-'Elenco residui'!E16","v":51897},-127116.93,0,"No",451847,-127116.93]
[null,20180000007,{"$f":"'Elenco residui'!C17","v":0},{"$f":"'Elenco residui'!D17-'Elenco residui'!E17","v":31481.9},-95635.03,0,"No",451847,-95635.03]
[null,20180000008,{"$f":"'Elenco residui'!C18","v":0},{"$f":"'Elenco residui'!D18-'Elenco residui'!E18","v":127514.11},31879.08,1,"Sì",451847,-419967.92]
[null,20180000009,{"$f":"'Elenco residui'!C19","v":0},{"$f":"'Elenco residui'!D19-'Elenco residui'!E19","v":97295},-322672.92,0,"No",451847,-322672.92]
[null,20180000010,{"$f":"'Elenco residui'!C20","v":0},{"$f":"'Elenco residui'!D20-'Elenco residui'!E20","v":22801},-299871.92,0,"No",451847,-299871.92]
[null,20180000011,{"$f":"'Elenco residui'!C21","v":0},{"$f":"'Elenco residui'!D21-'Elenco residui'!E21","v":25193},-274678.92,0,"No",451847,-274678.92]
[null,20180000012,{"$f":"'Elenco residui'!C22","v":0},{"$f":"'Elenco residui'!D22-'Elenco residui'!E22","v":81045},-193633.91999999998,0,"No",451847,-193633.91999999998]
[null,20180000013,{"$f":"'Elenco residui'!C23","v":0},{"$f":"'Elenco residui'!D23-'Elenco residui'!E23","v":103373},-90260.919999999984,0,"No",451847,-90260.919999999984]
[null,20180000014,{"$f":"'Elenco residui'!C24","v":0},{"$f":"'Elenco residui'!D24-'Elenco residui'!E24","v":82839},-7421.9199999999837,0,"No",451847,-7421.9199999999837]
[null,20180000015,{"$f":"'Elenco residui'!C25","v":0},{"$f":"'Elenco residui'!D25-'Elenco residui'!E25","v":53421.01},45999.090000000018,1,"Sì",451847,-405847.91]
[null,20180000016,{"$f":"'Elenco residui'!C26","v":0},{"$f":"'Elenco residui'!D26-'Elenco residui'!E26","v":50992},-354855.91,0,"No",451847,-354855.91]
[null,20180000017,{"$f":"'Elenco residui'!C27","v":0},{"$f":"'Elenco residui'!D27-'Elenco residui'!E27","v":11853},-343002.91,0,"No",451847,-343002.91]
[null,20180000018,{"$f":"'Elenco residui'!C28","v":0},{"$f":"'Elenco residui'!D28-'Elenco residui'!E28","v":19407},-323595.90999999997,0,"No",451847,-323595.90999999997]
[null,20180000019,{"$f":"'Elenco residui'!C29","v":0},{"$f":"'Elenco residui'!D29-'Elenco residui'!E29","v":93762},-229833.90999999997,0,"No",451847,-229833.90999999997]
[null,20180000020,{"$f":"'Elenco residui'!C30","v":0},{"$f":"'Elenco residui'!D30-'Elenco residui'!E30","v":369018},139184.09000000003,1,"Sì",451847,-312662.90999999997]
[null,20180000021,{"$f":"'Elenco residui'!C31","v":0},{"$f":"'Elenco residui'!D31-'Elenco residui'!E31","v":300000},-12662.909999999974,0,"No",451847,-12662.909999999974]
[null,20180000022,{"$f":"'Elenco residui'!C32","v":0},{"$f":"'Elenco residui'!D32-'Elenco residui'!E32","v":138984},126321.09000000003,1,"Sì",451847,-325525.90999999997]
[null,20180000023,{"$f":"'Elenco residui'!C33","v":0},{"$f":"'Elenco residui'!D33-'Elenco residui'!E33","v":112120},-213405.90999999997,0,"No",451847,-213405.90999999997]
[null,20180000024,{"$f":"'Elenco residui'!C34","v":0},{"$f":"'Elenco residui'!D34-'Elenco residui'!E34","v":147019},-66386.909999999974,0,"No",451847,-66386.909999999974]
[null,20180000025,{"$f":"'Elenco residui'!C35","v":0},{"$f":"'Elenco residui'!D35-'Elenco residui'!E35","v":170000},103613.09000000003,1,"Sì",451847,-348233.91]
[null,20180000026,{"$f":"'Elenco residui'!C36","v":0},{"$f":"'Elenco residui'!D36-'Elenco residui'!E36","v":140000},-208233.90999999997,0,"No",451847,-208233.90999999997]
[null,20180000027,{"$f":"'Elenco residui'!C37","v":0},{"$f":"'Elenco residui'!D37-'Elenco residui'!E37","v":8403},-199830.90999999997,0,"No",451847,-199830.90999999997]
[null,20180000028,{"$f":"'Elenco residui'!C38","v":0},{"$f":"'Elenco residui'!D38-'Elenco residui'!E38","v":5568},-194262.90999999997,0,"No",451847,-194262.90999999997]
[null,20180000029,{"$f":"'Elenco residui'!C39","v":0},{"$f":"'Elenco residui'!D39-'Elenco residui'!E39","v":69440},-124822.90999999997,0,"No",451847,-124822.90999999997]
[null,20180000030,{"$f":"'Elenco residui'!C40","v":0},{"$f":"'Elenco residui'!D40-'Elenco residui'!E40","v":21855},-102967.90999999997,0,"No",451847,-102967.90999999997]
[null,20180000031,{"$f":"'Elenco residui'!C41","v":0},{"$f":"'Elenco residui'!D41-'Elenco residui'!E41","v":321548.75},218580.84000000003,1,"Sì",451847,-233266.15999999997]
[null,20180000032,{"$f":"'Elenco residui'!C42","v":0},{"$f":"'Elenco residui'!D42-'Elenco residui'!E42","v":9107.2099999999991},-224158.94999999998,0,"No",451847,-224158.94999999998]
[null,20180000033,{"$f":"'Elenco residui'!C43","v":0},{"$f":"'Elenco residui'!D43-'Elenco residui'!E43","v":1557548.98},1333390.03,3,"Sì",{"$f":"$I$10","v":451847},-22150.969999999972]
[null,20180000034,{"$f":"'Elenco residui'!C44","v":0},{"$f":"'Elenco residui'!D44-'Elenco residui'!E44","v":2200238.2000000002},2178087.2300000004,5,"Sì",451847,-81147.769999999553]
[null,20180000035,{"$f":"'Elenco residui'!C45","v":0},{"$f":"'Elenco residui'!D45-'Elenco residui'!E45","v":5773},-75374.769999999553,0,"No",451847,-75374.769999999553]
[null,20180000036,{"$f":"'Elenco residui'!C46","v":0},{"$f":"'Elenco residui'!D46-'Elenco residui'!E46","v":372179.98},296805.21000000043,1,"Sì",451847,-155041.78999999957]
[null,20180000037,{"$f":"'Elenco residui'!C47","v":0},{"$f":"'Elenco residui'!D47-'Elenco residui'!E47","v":13784.55},-141257.23999999958,0,"No",451847,-141257.23999999958]
[null,20180000038,{"$f":"'Elenco residui'!C48","v":0},{"$f":"'Elenco residui'!D48-'Elenco residui'!E48","v":41266.69},-99990.549999999581,0,"No",451847,-99990.549999999581]
[null,20180000039,{"$f":"'Elenco residui'!C49","v":0},{"$f":"'Elenco residui'!D49-'Elenco residui'!E49","v":185267.17},85276.620000000432,1,"Sì",451847,-366570.37999999954]
[null,20180000040,{"$f":"'Elenco residui'!C50","v":0},{"$f":"'Elenco residui'!D50-'Elenco residui'!E50","v":93551.67},-273018.70999999956,0,"No",451847,-273018.70999999956]
[null,20180000041,{"$f":"'Elenco residui'!C51","v":0},{"$f":"'Elenco residui'!D51-'Elenco residui'!E51","v":42438.11},-230580.59999999957,0,"No",451847,-230580.59999999957]
[null,20180000042,{"$f":"'Elenco residui'!C52","v":0},{"$f":"'Elenco residui'!D52-'Elenco residui'!E52","v":426.08},-230154.51999999958,0,"No",451847,-230154.51999999958]
[null,20180000043,{"$f":"'Elenco residui'!C53","v":0},{"$f":"'Elenco residui'!D53-'Elenco residui'!E53","v":35000},-195154.51999999958,0,"No",451847,-195154.51999999958]
[null,20180000044,{"$f":"'Elenco residui'!C54","v":0},{"$f":"'Elenco residui'!D54-'Elenco residui'!E54","v":20370},-174784.51999999958,0,"No",451847,-174784.51999999958]
[null,20180000045,{"$f":"'Elenco residui'!C55","v":0},{"$f":"'Elenco residui'!D55-'Elenco residui'!E55","v":20000},-154784.51999999958,0,"No",451847,-154784.51999999958]
[null,20180000046,{"$f":"'Elenco residui'!C56","v":0},{"$f":"'Elenco residui'!D56-'Elenco residui'!E56","v":124689.92},-30094.599999999584,0,"No",451847,-30094.599999999584]
[null,20180000047,{"$f":"'Elenco residui'!C57","v":0},{"$f":"'Elenco residui'!D57-'Elenco residui'!E57","v":421351},391256.40000000043,1,"Sì",451847,-60590.599999999569]
[null,20180000048,{"$f":"'Elenco residui'!C58","v":0},{"$f":"'Elenco residui'!D58-'Elenco residui'!E58","v":15000},-45590.599999999569,0,"No",451847,-45590.599999999569]
[null,20180000049,{"$f":"'Elenco residui'!C59","v":0},{"$f":"'Elenco residui'!D59-'Elenco residui'!E59","v":225888.11},180297.51000000042,1,"Sì",451847,-271549.48999999958]
[null,20180000050,{"$f":"'Elenco residui'!C60","v":0},{"$f":"'Elenco residui'!D60-'Elenco residui'!E60","v":1000},-270549.48999999958,0,"No",451847,-270549.48999999958]
[null,20180000051,{"$f":"'Elenco residui'!C61","v":0},{"$f":"'Elenco residui'!D61-'Elenco residui'!E61","v":3806.64},-266742.84999999957,0,"No",451847,-266742.84999999957]
[null,20180000052,{"$f":"'Elenco residui'!C62","v":0},{"$f":"'Elenco residui'!D62-'Elenco residui'!E62","v":89000},-177742.84999999957,0,"No",451847,-177742.84999999957]
[null,20180000053,{"$f":"'Elenco residui'!C63","v":0},{"$f":"'Elenco residui'!D63-'Elenco residui'!E63","v":35400},-142342.84999999957,0,"No",451847,-142342.84999999957]
[null,20180000054,{"$f":"'Elenco residui'!C64","v":0},{"$f":"'Elenco residui'!D64-'Elenco residui'!E64","v":25000},-117342.84999999957,0,"No",451847,-117342.84999999957]
[null,20180000055,{"$f":"'Elenco residui'!C65","v":0},{"$f":"'Elenco residui'!D65-'Elenco residui'!E65","v":57192.43},-60150.419999999569,0,"No",451847,-60150.419999999569]
[null,20180000056,{"$f":"'Elenco residui'!C66","v":0},{"$f":"'Elenco residui'!D66-'Elenco residui'!E66","v":92535},32384.580000000431,1,"Sì",451847,-419462.41999999958]
[null,20180000057,{"$f":"'Elenco residui'!C67","v":0},{"$f":"'Elenco residui'!D67-'Elenco residui'!E67","v":10693.79},-408768.6299999996,0,"No",451847,-408768.6299999996]
[null,20180000058,{"$f":"'Elenco residui'!C68","v":0},{"$f":"'Elenco residui'!D68-'Elenco residui'!E68","v":15301.5},-393467.1299999996,0,"No",451847,-393467.1299999996]
[null,20180000059,{"$f":"'Elenco residui'!C69","v":0},{"$f":"'Elenco residui'!D69-'Elenco residui'!E69","v":97000},-296467.1299999996,0,"No",451847,-296467.1299999996]
[null,20180000060,{"$f":"'Elenco residui'!C70","v":0},{"$f":"'Elenco residui'!D70-'Elenco residui'!E70","v":10000},-286467.1299999996,0,"No",451847,-286467.1299999996]
[null,20180000061,{"$f":"'Elenco residui'!C71","v":0},{"$f":"'Elenco residui'!D71-'Elenco residui'!E71","v":11244.1},-275223.02999999962,0,"No",451847,-275223.02999999962]
[null,20180000062,{"$f":"'Elenco residui'!C72","v":0},{"$f":"'Elenco residui'!D72-'Elenco residui'!E72","v":35184.65},-240038.37999999963,0,"No",451847,-240038.37999999963]
[null,20180000063,{"$f":"'Elenco residui'!C73","v":0},{"$f":"'Elenco residui'!D73-'Elenco residui'!E73","v":175582},-64456.379999999626,0,"No",451847,-64456.379999999626]
[null,20180000064,{"$f":"'Elenco residui'!C74","v":0},{"$f":"'Elenco residui'!D74-'Elenco residui'!E74","v":59531.32},-4925.0599999996266,0,"No",451847,-4925.0599999996266]
[null,20180000065,{"$f":"'Elenco residui'!C75","v":0},{"$f":"'Elenco residui'!D75-'Elenco residui'!E75","v":199442.41},194517.35000000038,{"$f":"IF(E83>0,ROUND(E83/H83+0.5,0),0)","v":1},"Sì",{"$f":"$I$10","v":451847},{"$f":"E83-(F83*H83)","v":-257329.64999999962}]
[null,20180000066,{"$f":"'Elenco residui'!C76","v":0},{"$f":"'Elenco residui'!D76-'Elenco residui'!E76","v":159.63999999999999},{"$f":"D84+I83","v":-257170.0099999996},0,{"$f":"IF(F84=0,\"No\",\"Sì\")","v":"No"},451847,-257170.0099999996]
[null,20180000067,{"$f":"'Elenco residui'!C77","v":0},{"$f":"'Elenco residui'!D77-'Elenco residui'!E77","v":3518.97},-253651.0399999996,0,"No",451847,-253651.0399999996]
[null,20180000068,{"$f":"'Elenco residui'!C78","v":0},{"$f":"'Elenco residui'!D78-'Elenco residui'!E78","v":315.82},-253335.21999999959,0,"No",451847,-253335.21999999959]
[null,20180000069,{"$f":"'Elenco residui'!C79","v":0},{"$f":"'Elenco residui'!D79-'Elenco residui'!E79","v":389.51},-252945.70999999958,0,"No",451847,-252945.70999999958]
[null,20180000070,{"$f":"'Elenco residui'!C80","v":0},{"$f":"'Elenco residui'!D80-'Elenco residui'!E80","v":1723.44},-251222.26999999958,0,"No",451847,-251222.26999999958]
[null,20180000071,{"$f":"'Elenco residui'!C81","v":0},{"$f":"'Elenco residui'!D81-'Elenco residui'!E81","v":104.3},-251117.96999999959,0,"No",451847,-251117.96999999959]
[null,20180000072,{"$f":"'Elenco residui'!C82","v":0},{"$f":"'Elenco residui'!D82-'Elenco residui'!E82","v":1043},-250074.96999999959,0,"No",451847,-250074.96999999959]
[null,20180000073,{"$f":"'Elenco residui'!C83","v":0},{"$f":"'Elenco residui'!D83-'Elenco residui'!E83","v":726.82},-249348.14999999959,0,"No",451847,-249348.14999999959]
[null,20180000074,{"$f":"'Elenco residui'!C84","v":0},{"$f":"'Elenco residui'!D84-'Elenco residui'!E84","v":971},-248377.14999999959,0,"No",451847,-248377.14999999959]
[null,20180000075,{"$f":"'Elenco residui'!C85","v":0},{"$f":"'Elenco residui'!D85-'Elenco residui'!E85","v":2070.5},-246306.64999999959,0,"No",451847,-246306.64999999959]
[null,20180000076,{"$f":"'Elenco residui'!C86","v":0},{"$f":"'Elenco residui'!D86-'Elenco residui'!E86","v":876.9},-245429.74999999959,0,"No",451847,-245429.74999999959]
[null,20180000077,{"$f":"'Elenco residui'!C87","v":0},{"$f":"'Elenco residui'!D87-'Elenco residui'!E87","v":1204},-244225.74999999959,0,"No",451847,-244225.74999999959]
[null,20180000078,{"$f":"'Elenco residui'!C88","v":0},{"$f":"'Elenco residui'!D88-'Elenco residui'!E88","v":3003.2},-241222.54999999958,0,"No",451847,-241222.54999999958]
[null,20180000079,{"$f":"'Elenco residui'!C89","v":0},{"$f":"'Elenco residui'!D89-'Elenco residui'!E89","v":346.4},-240876.14999999959,0,"No",451847,-240876.14999999959]
[null,20180000080,{"$f":"'Elenco residui'!C90","v":0},{"$f":"'Elenco residui'!D90-'Elenco residui'!E90","v":300},-240576.14999999959,0,"No",451847,-240576.14999999959]
[null,20180000081,{"$f":"'Elenco residui'!C91","v":0},{"$f":"'Elenco residui'!D91-'Elenco residui'!E91","v":104.3},-240471.8499999996,0,"No",451847,-240471.8499999996]
[null,20180000082,{"$f":"'Elenco residui'!C92","v":0},{"$f":"'Elenco residui'!D92-'Elenco residui'!E92","v":164478.14000000001},-75993.709999999584,0,"No",451847,-75993.709999999584]
[null,20180000083,{"$f":"'Elenco residui'!C93","v":0},{"$f":"'Elenco residui'!D93-'Elenco residui'!E93","v":244736.62},168742.91000000041,1,"Sì",451847,-283104.08999999962]
[null,20180000084,{"$f":"'Elenco residui'!C94","v":0},{"$f":"'Elenco residui'!D94-'Elenco residui'!E94","v":290570.12},7466.0300000003772,1,"Sì",451847,-444380.96999999962]
[null,20180000085,{"$f":"'Elenco residui'!C95","v":0},{"$f":"'Elenco residui'!D95-'Elenco residui'!E95","v":31118.21},-413262.7599999996,0,"No",451847,-413262.7599999996]
[null,20180000086,{"$f":"'Elenco residui'!C96","v":0},{"$f":"'Elenco residui'!D96-'Elenco residui'!E96","v":18558.3},-394704.45999999961,0,"No",451847,-394704.45999999961]
[null,20180000087,{"$f":"'Elenco residui'!C97","v":0},{"$f":"'Elenco residui'!D97-'Elenco residui'!E97","v":506.17},-394198.28999999963,0,"No",451847,-394198.28999999963]
[null,20180000088,{"$f":"'Elenco residui'!C98","v":0},{"$f":"'Elenco residui'!D98-'Elenco residui'!E98","v":712.77},-393485.51999999961,0,"No",451847,-393485.51999999961]
[null,20180000089,{"$f":"'Elenco residui'!C99","v":0},{"$f":"'Elenco residui'!D99-'Elenco residui'!E99","v":248873.67},-144611.8499999996,0,"No",451847,-144611.8499999996]
[null,20180000090,{"$f":"'Elenco residui'!C100","v":0},{"$f":"'Elenco residui'!D100-'Elenco residui'!E100","v":555800.46},411188.61000000034,1,"Sì",451847,-40658.389999999665]
[null,20180000091,{"$f":"'Elenco residui'!C101","v":0},{"$f":"'Elenco residui'!D101-'Elenco residui'!E101","v":215123.87},174465.48000000033,1,"Sì",451847,-277381.51999999967]
[null,20180000092,{"$f":"'Elenco residui'!C102","v":0},{"$f":"'Elenco residui'!D102-'Elenco residui'!E102","v":260},-277121.51999999967,0,"No",451847,-277121.51999999967]
[null,20180000093,{"$f":"'Elenco residui'!C103","v":0},{"$f":"'Elenco residui'!D103-'Elenco residui'!E103","v":250},-276871.51999999967,0,"No",451847,-276871.51999999967]
[null,20180000094,{"$f":"'Elenco residui'!C104","v":0},{"$f":"'Elenco residui'!D104-'Elenco residui'!E104","v":250},-276621.51999999967,0,"No",451847,-276621.51999999967]
[null,20180000095,{"$f":"'Elenco residui'!C105","v":0},{"$f":"'Elenco residui'!D105-'Elenco residui'!E105","v":60},-276561.51999999967,0,"No",451847,-276561.51999999967]
[null,20180000096,{"$f":"'Elenco residui'!C106","v":0},{"$f":"'Elenco residui'!D106-'Elenco residui'!E106","v":2020},-274541.51999999967,0,"No",451847,-274541.51999999967]
[null,20180000097,{"$f":"'Elenco residui'!C107","v":0},{"$f":"'Elenco residui'!D107-'Elenco residui'!E107","v":120},-274421.51999999967,0,"No",451847,-274421.51999999967]
[null,20180000098,{"$f":"'Elenco residui'!C108","v":0},{"$f":"'Elenco residui'!D108-'Elenco residui'!E108","v":180},-274241.51999999967,0,"No",451847,-274241.51999999967]
[null,20180000099,{"$f":"'Elenco residui'!C109","v":0},{"$f":"'Elenco residui'!D109-'Elenco residui'!E109","v":150},-274091.51999999967,0,"No",451847,-274091.51999999967]
[null,20180000100,{"$f":"'Elenco residui'!C110","v":0},{"$f":"'Elenco residui'!D110-'Elenco residui'!E110","v":650},-273441.51999999967,0,"No",{"$f":"$I$10","v":451847},-273441.51999999967]
[null,20180000101,{"$f":"'Elenco residui'!C111","v":0},{"$f":"'Elenco residui'!D111-'Elenco residui'!E111","v":150},-273291.51999999967,0,{"$f":"IF(F119=0,\"No\",\"Sì\")","v":"No"},451847,-273291.51999999967]
[null,20180000102,{"$f":"'Elenco residui'!C112","v":0},{"$f":"'Elenco residui'!D112-'Elenco residui'!E112","v":350},-272941.51999999967,0,"No",451847,-272941.51999999967]
[null,20180000103,{"$f":"'Elenco residui'!C113","v":0},{"$f":"'Elenco residui'!D113-'Elenco residui'!E113","v":175},-272766.51999999967,0,"No",451847,-272766.51999999967,null,null,null,{"$f":"D118","v":650}]
[null,20180000104,{"$f":"'Elenco residui'!C114","v":0},{"$f":"'Elenco residui'!D114-'Elenco residui'!E114","v":480},-272286.51999999967,0,"No",451847,-272286.51999999967,null,null,null,{"$f":"M121-#REF!","v":{"$error":"#REF!"}}]
[null,20180000105,{"$f":"'Elenco residui'!C115","v":0},{"$f":"'Elenco residui'!D115-'Elenco residui'!E115","v":15},-272271.51999999967,0,"No",451847,-272271.51999999967]
[null,20180000106,{"$f":"'Elenco residui'!C116","v":0},{"$f":"'Elenco residui'!D116-'Elenco residui'!E116","v":450},-271821.51999999967,0,"No",451847,-271821.51999999967]
[null,20180000107,{"$f":"'Elenco residui'!C117","v":0},{"$f":"'Elenco residui'!D117-'Elenco residui'!E117","v":120},-271701.51999999967,0,"No",451847,-271701.51999999967]
[null,20180000108,{"$f":"'Elenco residui'!C118","v":0},{"$f":"'Elenco residui'!D118-'Elenco residui'!E118","v":120},-271581.51999999967,0,"No",451847,-271581.51999999967]
[null,20180000109,{"$f":"'Elenco residui'!C119","v":0},{"$f":"'Elenco residui'!D119-'Elenco residui'!E119","v":150},-271431.51999999967,0,"No",451847,-271431.51999999967]
[null,20180000110,{"$f":"'Elenco residui'!C120","v":0},{"$f":"'Elenco residui'!D120-'Elenco residui'!E120","v":150},-271281.51999999967,0,"No",451847,-271281.51999999967]
[null,20180000111,{"$f":"'Elenco residui'!C121","v":0},{"$f":"'Elenco residui'!D121-'Elenco residui'!E121","v":150},-271131.51999999967,0,"No",451847,-271131.51999999967]
[null,20180000112,{"$f":"'Elenco residui'!C122","v":0},{"$f":"'Elenco residui'!D122-'Elenco residui'!E122","v":150},-270981.51999999967,0,"No",451847,-270981.51999999967]
[null,20180000113,{"$f":"'Elenco residui'!C123","v":0},{"$f":"'Elenco residui'!D123-'Elenco residui'!E123","v":5000},-265981.51999999967,0,"No",451847,-265981.51999999967]
[null,20180000114,{"$f":"'Elenco residui'!C124","v":0},{"$f":"'Elenco residui'!D124-'Elenco residui'!E124","v":150},-265831.51999999967,0,"No",451847,-265831.51999999967]
[null,20180000115,{"$f":"'Elenco residui'!C125","v":0},{"$f":"'Elenco residui'!D125-'Elenco residui'!E125","v":325},-265506.51999999967,0,"No",451847,-265506.51999999967]
[null,20180000116,{"$f":"'Elenco residui'!C126","v":0},{"$f":"'Elenco residui'!D126-'Elenco residui'!E126","v":175},-265331.51999999967,0,"No",451847,-265331.51999999967]
[null,20180000117,{"$f":"'Elenco residui'!C127","v":0},{"$f":"'Elenco residui'!D127-'Elenco residui'!E127","v":170},-265161.51999999967,0,"No",451847,-265161.51999999967]
[null,20180000118,{"$f":"'Elenco residui'!C128","v":0},{"$f":"'Elenco residui'!D128-'Elenco residui'!E128","v":80},-265081.51999999967,0,"No",451847,-265081.51999999967]
[null,20180000119,{"$f":"'Elenco residui'!C129","v":0},{"$f":"'Elenco residui'!D129-'Elenco residui'!E129","v":600},-264481.51999999967,0,"No",451847,-264481.51999999967]
[null,20180000120,{"$f":"'Elenco residui'!C130","v":0},{"$f":"'Elenco residui'!D130-'Elenco residui'!E130","v":300},-264181.51999999967,0,"No",451847,-264181.51999999967]
[null,20180000121,{"$f":"'Elenco residui'!C131","v":0},{"$f":"'Elenco residui'!D131-'Elenco residui'!E131","v":120},-264061.51999999967,0,"No",451847,-264061.51999999967]
[null,20180000122,{"$f":"'Elenco residui'!C132","v":0},{"$f":"'Elenco residui'!D132-'Elenco residui'!E132","v":190},-263871.51999999967,0,"No",451847,-263871.51999999967]
[null,20180000123,{"$f":"'Elenco residui'!C133","v":0},{"$f":"'Elenco residui'!D133-'Elenco residui'!E133","v":300},-263571.51999999967,0,"No",451847,-263571.51999999967]
[null,20180000124,{"$f":"'Elenco residui'!C134","v":0},{"$f":"'Elenco residui'!D134-'Elenco residui'!E134","v":100},-263471.51999999967,0,"No",451847,-263471.51999999967]
[null,20180000125,{"$f":"'Elenco residui'!C135","v":0},{"$f":"'Elenco residui'!D135-'Elenco residui'!E135","v":60},-263411.51999999967,0,"No",451847,-263411.51999999967]
[null,20180000126,{"$f":"'Elenco residui'!C136","v":0},{"$f":"'Elenco residui'!D136-'Elenco residui'!E136","v":150},-263261.51999999967,0,"No",451847,-263261.51999999967]
[null,20180000127,{"$f":"'Elenco residui'!C137","v":0},{"$f":"'Elenco residui'!D137-'Elenco residui'!E137","v":150},-263111.51999999967,0,"No",451847,-263111.51999999967]
[null,20180000128,{"$f":"'Elenco residui'!C138","v":0},{"$f":"'Elenco residui'!D138-'Elenco residui'!E138","v":60},-263051.51999999967,0,"No",451847,-263051.51999999967]
[null,20180000129,{"$f":"'Elenco residui'!C139","v":0},{"$f":"'Elenco residui'!D139-'Elenco residui'!E139","v":100},-262951.51999999967,{"$f":"IF(E147>0,ROUND(E147/H147+0.5,0),0)","v":0},"No",451847,{"$f":"E147-(F147*H147)","v":-262951.51999999967}]
[null,20180000130,{"$f":"'Elenco residui'!C140","v":0},{"$f":"'Elenco residui'!D140-'Elenco residui'!E140","v":200},{"$f":"D148+I147","v":-262751.51999999967},0,"No",451847,-262751.51999999967]
[null,20180000131,{"$f":"'Elenco residui'!C141","v":0},{"$f":"'Elenco residui'!D141-'Elenco residui'!E141","v":1150},-261601.51999999967,0,"No",451847,-261601.51999999967]
[null,20180000132,{"$f":"'Elenco residui'!C142","v":0},{"$f":"'Elenco residui'!D142-'Elenco residui'!E142","v":60},-261541.51999999967,0,"No",451847,-261541.51999999967]
[null,20180000133,{"$f":"'Elenco residui'!C143","v":0},{"$f":"'Elenco residui'!D143-'Elenco residui'!E143","v":60},-261481.51999999967,0,"No",451847,-261481.51999999967]
[null,20180000134,{"$f":"'Elenco residui'!C144","v":0},{"$f":"'Elenco residui'!D144-'Elenco residui'!E144","v":350},-261131.51999999967,0,"No",451847,-261131.51999999967]
[null,20180000135,{"$f":"'Elenco residui'!C145","v":0},{"$f":"'Elenco residui'!D145-'Elenco residui'!E145","v":1200},-259931.51999999967,0,"No",451847,-259931.51999999967]
[null,20180000136,{"$f":"'Elenco residui'!C146","v":0},{"$f":"'Elenco residui'!D146-'Elenco residui'!E146","v":120},-259811.51999999967,0,"No",451847,-259811.51999999967]
[null,20180000137,{"$f":"'Elenco residui'!C147","v":0},{"$f":"'Elenco residui'!D147-'Elenco residui'!E147","v":100},-259711.51999999967,0,"No",451847,-259711.51999999967]
[null,20180000138,{"$f":"'Elenco residui'!C148","v":0},{"$f":"'Elenco residui'!D148-'Elenco residui'!E148","v":120},-259591.51999999967,0,"No",451847,-259591.51999999967]
[null,20180000139,{"$f":"'Elenco residui'!C149","v":0},{"$f":"'Elenco residui'!D149-'Elenco residui'!E149","v":2070.25},-257521.26999999967,0,"No",451847,-257521.26999999967]
[null,20180000140,{"$f":"'Elenco residui'!C150","v":0},{"$f":"'Elenco residui'!D150-'Elenco residui'!E150","v":2070.25},-255451.01999999967,0,"No",451847,-255451.01999999967]
[null,20180000141,{"$f":"'Elenco residui'!C151","v":0},{"$f":"'Elenco residui'!D151-'Elenco residui'!E151","v":3456},-251995.01999999967,0,"No",451847,-251995.01999999967]
[null,20180000142,{"$f":"'Elenco residui'!C152","v":0},{"$f":"'Elenco residui'!D152-'Elenco residui'!E152","v":750},-251245.01999999967,0,"No",451847,-251245.01999999967]
[null,20180000143,{"$f":"'Elenco residui'!C153","v":0},{"$f":"'Elenco residui'!D153-'Elenco residui'!E153","v":360},-250885.01999999967,0,"No",451847,-250885.01999999967]
[null,20180000144,{"$f":"'Elenco residui'!C154","v":0},{"$f":"'Elenco residui'!D154-'Elenco residui'!E154","v":326.74},-250558.27999999968,0,"No",451847,-250558.27999999968]
[null,20180000145,{"$f":"'Elenco residui'!C155","v":0},{"$f":"'Elenco residui'!D155-'Elenco residui'!E155","v":457.6},-250100.67999999967,0,"No",451847,-250100.67999999967]
[null,20180000146,{"$f":"'Elenco residui'!C156","v":0},{"$f":"'Elenco residui'!D156-'Elenco residui'!E156","v":43301.83},-206798.84999999969,0,"No",451847,-206798.84999999969]
[null,20180000147,{"$f":"'Elenco residui'!C157","v":0},{"$f":"'Elenco residui'!D157-'Elenco residui'!E157","v":1152},-205646.84999999969,0,"No",451847,-205646.84999999969]
[null,20180000148,{"$f":"'Elenco residui'!C158","v":0},{"$f":"'Elenco residui'!D158-'Elenco residui'!E158","v":1978.78},-203668.06999999969,0,"No",451847,-203668.06999999969]
[null,20180000149,{"$f":"'Elenco residui'!C159","v":0},{"$f":"'Elenco residui'!D159-'Elenco residui'!E159","v":210},-203458.06999999969,0,"No",451847,-203458.06999999969]
[null,20180000150,{"$f":"'Elenco residui'!C160","v":0},{"$f":"'Elenco residui'!D160-'Elenco residui'!E160","v":3456},-200002.06999999969,0,"No",451847,-200002.06999999969]
[null,20180000151,{"$f":"'Elenco residui'!C161","v":0},{"$f":"'Elenco residui'!D161-'Elenco residui'!E161","v":360},-199642.06999999969,0,"No",451847,-199642.06999999969]
[null,20180000152,{"$f":"'Elenco residui'!C162","v":0},{"$f":"'Elenco residui'!D162-'Elenco residui'!E162","v":3456},-196186.06999999969,0,"No",451847,-196186.06999999969]
[null,20180000153,{"$f":"'Elenco residui'!C163","v":0},{"$f":"'Elenco residui'!D163-'Elenco residui'!E163","v":750},-195436.06999999969,0,"No",451847,-195436.06999999969]
[null,20180000154,{"$f":"'Elenco residui'!C164","v":0},{"$f":"'Elenco residui'!D164-'Elenco residui'!E164","v":3615},-191821.06999999969,0,"No",451847,-191821.06999999969]
[null,20180000155,{"$f":"'Elenco residui'!C165","v":0},{"$f":"'Elenco residui'!D165-'Elenco residui'!E165","v":297},-191524.06999999969,0,"No",451847,-191524.06999999969]
[null,20180000156,{"$f":"'Elenco residui'!C166","v":0},{"$f":"'Elenco residui'!D166-'Elenco residui'!E166","v":624.84},-190899.22999999969,0,"No",451847,-190899.22999999969]
[null,20180000157,{"$f":"'Elenco residui'!C167","v":0},{"$f":"'Elenco residui'!D167-'Elenco residui'!E167","v":413},-190486.22999999969,0,"No",451847,-190486.22999999969]
[null,20180000158,{"$f":"'Elenco residui'!C168","v":0},{"$f":"'Elenco residui'!D168-'Elenco residui'!E168","v":421.4},-190064.8299999997,0,"No",451847,-190064.8299999997]
[null,20180000159,{"$f":"'Elenco residui'!C169","v":0},{"$f":"'Elenco residui'!D169-'Elenco residui'!E169","v":1500},-188564.8299999997,0,"No",451847,-188564.8299999997]
[null,20180000160,{"$f":"'Elenco residui'!C170","v":0},{"$f":"'Elenco residui'!D170-'Elenco residui'!E170","v":300},-188264.8299999997,0,"No",451847,-188264.8299999997]
[null,20180000161,{"$f":"'Elenco residui'!C171","v":0},{"$f":"'Elenco residui'!D171-'Elenco residui'!E171","v":1122},-187142.8299999997,0,"No",451847,-187142.8299999997]
[null,20180000162,{"$f":"'Elenco residui'!C172","v":0},{"$f":"'Elenco residui'!D172-'Elenco residui'!E172","v":840},-186302.8299999997,0,"No",451847,-186302.8299999997]
[null,20180000163,{"$f":"'Elenco residui'!C173","v":0},{"$f":"'Elenco residui'!D173-'Elenco residui'!E173","v":1600},-184702.8299999997,0,"No",451847,-184702.8299999997]
[null,20180000164,{"$f":"'Elenco residui'!C174","v":0},{"$f":"'Elenco residui'!D174-'Elenco residui'!E174","v":952.2},-183750.62999999968,0,"No",{"$f":"$I$10","v":451847},-183750.62999999968]
[null,20180000165,{"$f":"'Elenco residui'!C175","v":0},{"$f":"'Elenco residui'!D175-'Elenco residui'!E175","v":698},-183052.62999999968,0,{"$f":"IF(F183=0,\"No\",\"Sì\")","v":"No"},451847,-183052.62999999968]
[null,20180000166,{"$f":"'Elenco residui'!C176","v":0},{"$f":"'Elenco residui'!D176-'Elenco residui'!E176","v":2711.3},-180341.3299999997,0,"No",451847,-180341.3299999997]
[null,20180000167,{"$f":"'Elenco residui'!C177","v":0},{"$f":"'Elenco residui'!D177-'Elenco residui'!E177","v":297},-180044.3299999997,0,"No",451847,-180044.3299999997]
[null,20180000168,{"$f":"'Elenco residui'!C178","v":0},{"$f":"'Elenco residui'!D178-'Elenco residui'!E178","v":318.88},-179725.44999999969,0,"No",451847,-179725.44999999969]
[null,20180000169,{"$f":"'Elenco residui'!C179","v":0},{"$f":"'Elenco residui'!D179-'Elenco residui'!E179","v":698},-179027.44999999969,0,"No",451847,-179027.44999999969]
[null,20180000170,{"$f":"'Elenco residui'!C180","v":0},{"$f":"'Elenco residui'!D180-'Elenco residui'!E180","v":3615},-175412.44999999969,0,"No",451847,-175412.44999999969]
[null,20180000171,{"$f":"'Elenco residui'!C181","v":0},{"$f":"'Elenco residui'!D181-'Elenco residui'!E181","v":297},-175115.44999999969,0,"No",451847,-175115.44999999969]
[null,20180000172,{"$f":"'Elenco residui'!C182","v":0},{"$f":"'Elenco residui'!D182-'Elenco residui'!E182","v":392.8},-174722.6499999997,0,"No",451847,-174722.6499999997]
[null,20180000173,{"$f":"'Elenco residui'!C183","v":0},{"$f":"'Elenco residui'!D183-'Elenco residui'!E183","v":67000},-107722.6499999997,0,"No",451847,-107722.6499999997]
[null,20180000174,{"$f":"'Elenco residui'!C184","v":0},{"$f":"'Elenco residui'!D184-'Elenco residui'!E184","v":3000},-104722.6499999997,0,"No",451847,-104722.6499999997]
[null,20180000175,{"$f":"'Elenco residui'!C185","v":0},{"$f":"'Elenco residui'!D185-'Elenco residui'!E185","v":7440},-97282.649999999703,0,"No",451847,-97282.649999999703]
[null,20180000176,{"$f":"'Elenco residui'!C186","v":0},{"$f":"'Elenco residui'!D186-'Elenco residui'!E186","v":2500},-94782.649999999703,0,"No",451847,-94782.649999999703]
[null,20180000177,{"$f":"'Elenco residui'!C187","v":0},{"$f":"'Elenco residui'!D187-'Elenco residui'!E187","v":3220},-91562.649999999703,0,"No",451847,-91562.649999999703]
[null,20180000178,{"$f":"'Elenco residui'!C188","v":0},{"$f":"'Elenco residui'!D188-'Elenco residui'!E188","v":3500},-88062.649999999703,0,"No",451847,-88062.649999999703]
[null,20180000179,{"$f":"'Elenco residui'!C189","v":0},{"$f":"'Elenco residui'!D189-'Elenco residui'!E189","v":610},-87452.649999999703,0,"No",451847,-87452.649999999703]
[null,20180000180,{"$f":"'Elenco residui'!C190","v":0},{"$f":"'Elenco residui'!D190-'Elenco residui'!E190","v":220},-87232.649999999703,0,"No",451847,-87232.649999999703]
[null,20180000181,{"$f":"'Elenco residui'!C191","v":0},{"$f":"'Elenco residui'!D191-'Elenco residui'!E191","v":1220},-86012.649999999703,0,"No",451847,-86012.649999999703]
[null,20180000182,{"$f":"'Elenco residui'!C192","v":0},{"$f":"'Elenco residui'!D192-'Elenco residui'!E192","v":12810},-73202.649999999703,0,"No",451847,-73202.649999999703]
[null,20180000183,{"$f":"'Elenco residui'!C193","v":0},{"$f":"'Elenco residui'!D193-'Elenco residui'!E193","v":3660},-69542.649999999703,0,"No",451847,-69542.649999999703]
[null,20180000184,{"$f":"'Elenco residui'!C194","v":0},{"$f":"'Elenco residui'!D194-'Elenco residui'!E194","v":3797.56},-65745.089999999705,0,"No",451847,-65745.089999999705]
[null,20180000185,{"$f":"'Elenco residui'!C195","v":0},{"$f":"'Elenco residui'!D195-'Elenco residui'!E195","v":3939.83},-61805.259999999704,0,"No",451847,-61805.259999999704]
[null,20180000186,{"$f":"'Elenco residui'!C196","v":0},{"$f":"'Elenco residui'!D196-'Elenco residui'!E196","v":8116.03},-53689.229999999705,0,"No",451847,-53689.229999999705]
[null,20180000187,{"$f":"'Elenco residui'!C197","v":0},{"$f":"'Elenco residui'!D197-'Elenco residui'!E197","v":3283.62},-50405.609999999702,0,"No",451847,-50405.609999999702]
[null,20180000188,{"$f":"'Elenco residui'!C198","v":0},{"$f":"'Elenco residui'!D198-'Elenco residui'!E198","v":2004},-48401.609999999702,0,"No",451847,-48401.609999999702]
[null,20180000189,{"$f":"'Elenco residui'!C199","v":0},{"$f":"'Elenco residui'!D199-'Elenco residui'!E199","v":334.21},-48067.399999999703,0,"No",451847,-48067.399999999703]
[null,20180000190,{"$f":"'Elenco residui'!C200","v":0},{"$f":"'Elenco residui'!D200-'Elenco residui'!E200","v":114.18},-47953.219999999703,0,"No",451847,-47953.219999999703]
[null,20180000191,{"$f":"'Elenco residui'!C201","v":0},{"$f":"'Elenco residui'!D201-'Elenco residui'!E201","v":4815.4799999999996},-43137.7399999997,0,"No",451847,-43137.7399999997]
[null,20180000192,{"$f":"'Elenco residui'!C202","v":0},{"$f":"'Elenco residui'!D202-'Elenco residui'!E202","v":7297.44},-35840.299999999697,0,"No",451847,-35840.299999999697]
[null,20180000193,{"$f":"'Elenco residui'!C203","v":0},{"$f":"'Elenco residui'!D203-'Elenco residui'!E203","v":222.1},-35618.199999999699,{"$f":"IF(E211>0,ROUND(E211/H211+0.5,0),0)","v":0},"No",451847,{"$f":"E211-(F211*H211)","v":-35618.199999999699}]
[null,20180000194,{"$f":"'Elenco residui'!C204","v":0},{"$f":"'Elenco residui'!D204-'Elenco residui'!E204","v":885.78},{"$f":"D212+I211","v":-34732.4199999997},0,"No",451847,-34732.4199999997]
[null,20180000195,{"$f":"'Elenco residui'!C205","v":0},{"$f":"'Elenco residui'!D205-'Elenco residui'!E205","v":10000},-24732.4199999997,0,"No",451847,-24732.4199999997]
[null,20180000196,{"$f":"'Elenco residui'!C206","v":0},{"$f":"'Elenco residui'!D206-'Elenco residui'!E206","v":13950},-10782.4199999997,0,"No",451847,-10782.4199999997]
[null,20180000197,{"$f":"'Elenco residui'!C207","v":0},{"$f":"'Elenco residui'!D207-'Elenco residui'!E207","v":1183.4000000000001},-9599.0199999997003,0,"No",451847,-9599.0199999997003]
[null,20180000198,{"$f":"'Elenco residui'!C208","v":0},{"$f":"'Elenco residui'!D208-'Elenco residui'!E208","v":8164.89},-1434.1299999997,0,"No",451847,-1434.1299999997]
[null,20180000199,{"$f":"'Elenco residui'!C209","v":0},{"$f":"'Elenco residui'!D209-'Elenco residui'!E209","v":4409.4399999999996},2975.3100000002996,1,"Sì",451847,-448871.68999999971]
[null,20180000200,{"$f":"'Elenco residui'!C210","v":0},{"$f":"'Elenco residui'!D210-'Elenco residui'!E210","v":4573.3900000000003},-444298.2999999997,0,"No",451847,-444298.2999999997]
[null,20180000201,{"$f":"'Elenco residui'!C211","v":0},{"$f":"'Elenco residui'!D211-'Elenco residui'!E211","v":4209.54},-440088.75999999972,0,"No",451847,-440088.75999999972]
[null,20180000202,{"$f":"'Elenco residui'!C212","v":0},{"$f":"'Elenco residui'!D212-'Elenco residui'!E212","v":22},-440066.75999999972,0,"No",451847,-440066.75999999972]
[null,20180000203,{"$f":"'Elenco residui'!C213","v":0},{"$f":"'Elenco residui'!D213-'Elenco residui'!E213","v":33},-440033.75999999972,0,"No",451847,-440033.75999999972]
[null,20180000204,{"$f":"'Elenco residui'!C214","v":0},{"$f":"'Elenco residui'!D214-'Elenco residui'!E214","v":7916.03},-432117.72999999969,0,"No",451847,-432117.72999999969]
[null,20180000205,{"$f":"'Elenco residui'!C215","v":0},{"$f":"'Elenco residui'!D215-'Elenco residui'!E215","v":9954},-422163.72999999969,0,"No",451847,-422163.72999999969]
[null,20180000206,{"$f":"'Elenco residui'!C216","v":0},{"$f":"'Elenco residui'!D216-'Elenco residui'!E216","v":3188.42},-418975.30999999971,0,"No",451847,-418975.30999999971]
[null,20180000207,{"$f":"'Elenco residui'!C217","v":0},{"$f":"'Elenco residui'!D217-'Elenco residui'!E217","v":3380.67},-415594.63999999972,0,"No",451847,-415594.63999999972]
[null,20180000208,{"$f":"'Elenco residui'!C218","v":0},{"$f":"'Elenco residui'!D218-'Elenco residui'!E218","v":10457.719999999999},-405136.91999999975,0,"No",451847,-405136.91999999975]
[null,20180000209,{"$f":"'Elenco residui'!C219","v":0},{"$f":"'Elenco residui'!D219-'Elenco residui'!E219","v":80.02},-405056.89999999973,0,"No",451847,-405056.89999999973]
[null,20180000210,{"$f":"'Elenco residui'!C220","v":0},{"$f":"'Elenco residui'!D220-'Elenco residui'!E220","v":12.33},-405044.56999999972,0,"No",451847,-405044.56999999972]
[null,20180000211,{"$f":"'Elenco residui'!C221","v":0},{"$f":"'Elenco residui'!D221-'Elenco residui'!E221","v":476.95},-404567.6199999997,0,"No",451847,-404567.6199999997]
[null,20180000212,{"$f":"'Elenco residui'!C222","v":0},{"$f":"'Elenco residui'!D222-'Elenco residui'!E222","v":427.94},-404139.6799999997,0,"No",451847,-404139.6799999997]
[null,20180000213,{"$f":"'Elenco residui'!C223","v":0},{"$f":"'Elenco residui'!D223-'Elenco residui'!E223","v":7000},-397139.6799999997,0,"No",451847,-397139.6799999997]
[null,20180000214,{"$f":"'Elenco residui'!C224","v":0},{"$f":"'Elenco residui'!D224-'Elenco residui'!E224","v":8331.52},-388808.15999999968,0,"No",451847,-388808.15999999968]
[null,20180000215,{"$f":"'Elenco residui'!C225","v":0},{"$f":"'Elenco residui'!D225-'Elenco residui'!E225","v":2586.91},-386221.24999999971,0,"No",451847,-386221.24999999971]
[null,20180000216,{"$f":"'Elenco residui'!C226","v":0},{"$f":"'Elenco residui'!D226-'Elenco residui'!E226","v":8450},-377771.24999999971,0,"No",451847,-377771.24999999971]
[null,20180000217,{"$f":"'Elenco residui'!C227","v":0},{"$f":"'Elenco residui'!D227-'Elenco residui'!E227","v":20203},-357568.24999999971,0,"No",451847,-357568.24999999971]
[null,20180000218,{"$f":"'Elenco residui'!C228","v":0},{"$f":"'Elenco residui'!D228-'Elenco residui'!E228","v":12799.38},-344768.8699999997,0,"No",451847,-344768.8699999997]
[null,20180000219,{"$f":"'Elenco residui'!C229","v":0},{"$f":"'Elenco residui'!D229-'Elenco residui'!E229","v":11787.82},-332981.0499999997,0,"No",451847,-332981.0499999997]
[null,20180000220,{"$f":"'Elenco residui'!C230","v":0},{"$f":"'Elenco residui'!D230-'Elenco residui'!E230","v":196},-332785.0499999997,0,"No",451847,-332785.0499999997]
[null,20180000221,{"$f":"'Elenco residui'!C231","v":0},{"$f":"'Elenco residui'!D231-'Elenco residui'!E231","v":5000},-327785.0499999997,0,"No",451847,-327785.0499999997]
[null,20180000222,{"$f":"'Elenco residui'!C232","v":0},{"$f":"'Elenco residui'!D232-'Elenco residui'!E232","v":1690},-326095.0499999997,0,"No",451847,-326095.0499999997]
[null,20180000223,{"$f":"'Elenco residui'!C233","v":0},{"$f":"'Elenco residui'!D233-'Elenco residui'!E233","v":30390.63},-295704.41999999969,0,"No",451847,-295704.41999999969]
[null,20180000224,{"$f":"'Elenco residui'!C234","v":0},{"$f":"'Elenco residui'!D234-'Elenco residui'!E234","v":336.09},-295368.32999999967,0,"No",451847,-295368.32999999967]
[null,20180000225,{"$f":"'Elenco residui'!C235","v":0},{"$f":"'Elenco residui'!D235-'Elenco residui'!E235","v":1195.02},-294173.30999999965,0,"No",451847,-294173.30999999965]
[null,20180000226,{"$f":"'Elenco residui'!C236","v":0},{"$f":"'Elenco residui'!D236-'Elenco residui'!E236","v":1500},-292673.30999999965,0,"No",451847,-292673.30999999965]
[null,20180000227,{"$f":"'Elenco residui'!C237","v":0},{"$f":"'Elenco residui'!D237-'Elenco residui'!E237","v":5210.55},-287462.75999999966,0,"No",451847,-287462.75999999966]
[null,20180000228,{"$f":"'Elenco residui'!C238","v":0},{"$f":"'Elenco residui'!D238-'Elenco residui'!E238","v":4782.42},-282680.33999999968,0,"No",{"$f":"$I$10","v":451847},-282680.33999999968]
[null,20180000229,{"$f":"'Elenco residui'!C239","v":0},{"$f":"'Elenco residui'!D239-'Elenco residui'!E239","v":1586.36},-281093.97999999969,0,{"$f":"IF(F247=0,\"No\",\"Sì\")","v":"No"},451847,-281093.97999999969]
[null,20180000230,{"$f":"'Elenco residui'!C240","v":0},{"$f":"'Elenco residui'!D240-'Elenco residui'!E240","v":2113.7800000000002},-278980.19999999966,0,"No",451847,-278980.19999999966]
[null,20180000231,{"$f":"'Elenco residui'!C241","v":0},{"$f":"'Elenco residui'!D241-'Elenco residui'!E241","v":1100000},821019.80000000028,2,"Sì",451847,-82674.199999999721]
[null,20180000232,{"$f":"'Elenco residui'!C242","v":0},{"$f":"'Elenco residui'!D242-'Elenco residui'!E242","v":4727.4799999999996},-77946.719999999725,0,"No",451847,-77946.719999999725]
[null,20180000233,{"$f":"'Elenco residui'!C243","v":0},{"$f":"'Elenco residui'!D243-'Elenco residui'!E243","v":366000},288053.28000000026,1,"Sì",451847,-163793.71999999974]
[null,20180000234,{"$f":"'Elenco residui'!C244","v":0},{"$f":"'Elenco residui'!D244-'Elenco residui'!E244","v":56324.67},-107469.04999999974,0,"No",451847,-107469.04999999974]
[null,20180000235,{"$f":"'Elenco residui'!C245","v":0},{"$f":"'Elenco residui'!D245-'Elenco residui'!E245","v":1628258.96},1520789.9100000001,4,"Sì",451847,-286598.08999999985]
[null,20180000236,{"$f":"'Elenco residui'!C246","v":0},{"$f":"'Elenco residui'!D246-'Elenco residui'!E246","v":60000},-226598.08999999985,0,"No",451847,-226598.08999999985]
[null,20180000237,{"$f":"'Elenco residui'!C247","v":0},{"$f":"'Elenco residui'!D247-'Elenco residui'!E247","v":1444.65},-225153.43999999986,0,"No",451847,-225153.43999999986]
[null,20180000238,{"$f":"'Elenco residui'!C248","v":0},{"$f":"'Elenco residui'!D248-'Elenco residui'!E248","v":36217.279999999999},-188936.15999999986,0,"No",451847,-188936.15999999986]
[null,20180000239,{"$f":"'Elenco residui'!C249","v":0},{"$f":"'Elenco residui'!D249-'Elenco residui'!E249","v":1873.4},-187062.75999999986,0,"No",451847,-187062.75999999986]
[null,20180000240,{"$f":"'Elenco residui'!C250","v":0},{"$f":"'Elenco residui'!D250-'Elenco residui'!E250","v":5.86},-187056.89999999988,0,"No",451847,-187056.89999999988]
[null,20180000241,{"$f":"'Elenco residui'!C251","v":0},{"$f":"'Elenco residui'!D251-'Elenco residui'!E251","v":4451.7},-182605.19999999987,0,"No",451847,-182605.19999999987]
[null,20180000242,{"$f":"'Elenco residui'!C252","v":0},{"$f":"'Elenco residui'!D252-'Elenco residui'!E252","v":15905},-166700.19999999987,0,"No",451847,-166700.19999999987]
[null,20180000243,{"$f":"'Elenco residui'!C253","v":0},{"$f":"'Elenco residui'!D253-'Elenco residui'!E253","v":65000},-101700.19999999987,0,"No",451847,-101700.19999999987]
[null,20180000244,{"$f":"'Elenco residui'!C254","v":0},{"$f":"'Elenco residui'!D254-'Elenco residui'!E254","v":200000},98299.800000000134,1,"Sì",451847,-353547.19999999984]
[null,20180000245,{"$f":"'Elenco residui'!C255","v":0},{"$f":"'Elenco residui'!D255-'Elenco residui'!E255","v":646753.28000000003},293206.08000000019,1,"Sì",451847,-158640.91999999981]
[null,20180000246,{"$f":"'Elenco residui'!C256","v":0},{"$f":"'Elenco residui'!D256-'Elenco residui'!E256","v":1518920.9},1360279.98,4,"Sì",451847,-447108.02]
[null,20180000247,{"$f":"'Elenco residui'!C257","v":0},{"$f":"'Elenco residui'!D257-'Elenco residui'!E257","v":30000},-417108.02,0,"No",451847,-417108.02]
[null,20180000248,{"$f":"'Elenco residui'!C258","v":0},{"$f":"'Elenco residui'!D258-'Elenco residui'!E258","v":520000},102891.97999999998,1,"Sì",451847,-348955.02]
[null,20180000249,{"$f":"'Elenco residui'!C259","v":0},{"$f":"'Elenco residui'!D259-'Elenco residui'!E259","v":540000},191044.97999999998,1,"Sì",451847,-260802.02000000002]
[null,20180000250,{"$f":"'Elenco residui'!C260","v":0},{"$f":"'Elenco residui'!D260-'Elenco residui'!E260","v":400000},139197.97999999998,1,"Sì",451847,-312649.02]
[null,20180000251,{"$f":"'Elenco residui'!C261","v":0},{"$f":"'Elenco residui'!D261-'Elenco residui'!E261","v":25000},-287649.02,0,"No",451847,-287649.02]
[null,20180000252,{"$f":"'Elenco residui'!C262","v":0},{"$f":"'Elenco residui'!D262-'Elenco residui'!E262","v":5600.13},-282048.89,0,"No",451847,-282048.89]
[null,20180000253,{"$f":"'Elenco residui'!C263","v":0},{"$f":"'Elenco residui'!D263-'Elenco residui'!E263","v":649650},367601.11,1,"Sì",451847,-84245.890000000014]
[null,20180000254,{"$f":"'Elenco residui'!C264","v":0},{"$f":"'Elenco residui'!D264-'Elenco residui'!E264","v":71958.14},-12287.750000000015,0,"No",451847,-12287.750000000015]
[null,20180000255,{"$f":"'Elenco residui'!C265","v":0},{"$f":"'Elenco residui'!D265-'Elenco residui'!E265","v":150000},137712.25,1,"Sì",451847,-314134.75]
[null,20180000256,{"$f":"'Elenco residui'!C266","v":0},{"$f":"'Elenco residui'!D266-'Elenco residui'!E266","v":400288.89},86154.140000000014,1,"Sì",451847,-365692.86]
[null,20180000257,{"$f":"'Elenco residui'!C267","v":0},{"$f":"'Elenco residui'!D267-'Elenco residui'!E267","v":26731.94},-338960.92,{"$f":"IF(E275>0,ROUND(E275/H275+0.5,0),0)","v":0},"No",451847,{"$f":"E275-(F275*H275)","v":-338960.92}]
[null,20180000258,{"$f":"'Elenco residui'!C268","v":0},{"$f":"'Elenco residui'!D268-'Elenco residui'!E268","v":68968.800000000003},{"$f":"D276+I275","v":-269992.12},0,"No",451847,-269992.12]
[null,20180000259,{"$f":"'Elenco residui'!C269","v":0},{"$f":"'Elenco residui'!D269-'Elenco residui'!E269","v":2660249},2390256.88,6,"Sì",451847,-320825.12000000011]
[null,20180000260,{"$f":"'Elenco residui'!C270","v":0},{"$f":"'Elenco residui'!D270-'Elenco residui'!E270","v":70000},-250825.12000000011,0,"No",451847,-250825.12000000011]
[null,20180000261,{"$f":"'Elenco residui'!C271","v":0},{"$f":"'Elenco residui'!D271-'Elenco residui'!E271","v":196857.21},-53967.91000000012,0,"No",451847,-53967.91000000012]
[null,20180000262,{"$f":"'Elenco residui'!C272","v":0},{"$f":"'Elenco residui'!D272-'Elenco residui'!E272","v":285000},231032.08999999988,1,"Sì",451847,-220814.91000000012]
[null,20180000263,{"$f":"'Elenco residui'!C273","v":0},{"$f":"'Elenco residui'!D273-'Elenco residui'!E273","v":492697.66},271882.74999999988,1,"Sì",451847,-179964.25000000012]
[null,20180000264,{"$f":"'Elenco residui'!C274","v":0},{"$f":"'Elenco residui'!D274-'Elenco residui'!E274","v":200000},20035.749999999884,1,"Sì",451847,-431811.25000000012]
[null,20180000265,{"$f":"'Elenco residui'!C275","v":0},{"$f":"'Elenco residui'!D275-'Elenco residui'!E275","v":88616.84},-343194.41000000015,0,"No",451847,-343194.41000000015]
[null,20180000266,{"$f":"'Elenco residui'!C276","v":0},{"$f":"'Elenco residui'!D276-'Elenco residui'!E276","v":1314492.8799999999},971298.46999999974,3,"Sì",451847,-384242.53000000026]
[null,20180000267,{"$f":"'Elenco residui'!C277","v":0},{"$f":"'Elenco residui'!D277-'Elenco residui'!E277","v":576567.11},192324.57999999973,1,"Sì",451847,-259522.42000000027]
[null,20180000268,{"$f":"'Elenco residui'!C278","v":0},{"$f":"'Elenco residui'!D278-'Elenco residui'!E278","v":183000},-76522.420000000275,0,"No",451847,-76522.420000000275]
[null,20180000269,{"$f":"'Elenco residui'!C279","v":0},{"$f":"'Elenco residui'!D279-'Elenco residui'!E279","v":196857.21},120334.78999999972,1,"Sì",451847,-331512.21000000031]
[null,20180000270,{"$f":"'Elenco residui'!C280","v":0},{"$f":"'Elenco residui'!D280-'Elenco residui'!E280","v":285000},-46512.210000000312,0,"No",451847,-46512.210000000312]
[null,20180000271,{"$f":"'Elenco residui'!C281","v":0},{"$f":"'Elenco residui'!D281-'Elenco residui'!E281","v":492697.66},446185.44999999966,1,"Sì",451847,-5661.5500000003376]
[null,20180000272,{"$f":"'Elenco residui'!C282","v":0},{"$f":"'Elenco residui'!D282-'Elenco residui'!E282","v":100000},94338.449999999662,1,"Sì",451847,-357508.55000000034]
[null,20180000273,{"$f":"'Elenco residui'!C283","v":0},{"$f":"'Elenco residui'!D283-'Elenco residui'!E283","v":40000},-317508.55000000034,0,"No",451847,-317508.55000000034]
[null,20180000274,{"$f":"'Elenco residui'!C284","v":0},{"$f":"'Elenco residui'!D284-'Elenco residui'!E284","v":150000},-167508.55000000034,0,"No",451847,-167508.55000000034]
[null,20180000275,{"$f":"'Elenco residui'!C285","v":0},{"$f":"'Elenco residui'!D285-'Elenco residui'!E285","v":95689.42},-71819.130000000339,0,"No",451847,-71819.130000000339]
[null,20180000276,{"$f":"'Elenco residui'!C286","v":0},{"$f":"'Elenco residui'!D286-'Elenco residui'!E286","v":33911.58},-37907.550000000338,0,"No",451847,-37907.550000000338]
[null,20180000277,{"$f":"'Elenco residui'!C287","v":0},{"$f":"'Elenco residui'!D287-'Elenco residui'!E287","v":104059.59},66152.039999999659,1,"Sì",451847,-385694.96000000031]
[null,20180000278,{"$f":"'Elenco residui'!C288","v":0},{"$f":"'Elenco residui'!D288-'Elenco residui'!E288","v":14793.91},-370901.05000000034,0,"No",451847,-370901.05000000034]
[null,20180000279,{"$f":"'Elenco residui'!C289","v":0},{"$f":"'Elenco residui'!D289-'Elenco residui'!E289","v":99569.34},-271331.71000000031,0,"No",451847,-271331.71000000031]
[null,20180000280,{"$f":"'Elenco residui'!C290","v":0},{"$f":"'Elenco residui'!D290-'Elenco residui'!E290","v":375.82},-270955.89000000031,0,"No",451847,-270955.89000000031]
[null,20180000281,{"$f":"'Elenco residui'!C291","v":0},{"$f":"'Elenco residui'!D291-'Elenco residui'!E291","v":200000},-70955.890000000305,0,"No",451847,-70955.890000000305]
[null,20180000282,{"$f":"'Elenco residui'!C292","v":0},{"$f":"'Elenco residui'!D292-'Elenco residui'!E292","v":350000},279044.10999999969,1,"Sì",451847,-172802.89000000031]
[null,20180000283,{"$f":"'Elenco residui'!C293","v":0},{"$f":"'Elenco residui'!D293-'Elenco residui'!E293","v":28043.05},-144759.84000000032,0,"No",451847,-144759.84000000032]
[null,20180000284,{"$f":"'Elenco residui'!C294","v":0},{"$f":"'Elenco residui'!D294-'Elenco residui'!E294","v":27343.8},-117416.04000000031,0,"No",451847,-117416.04000000031]
[null,20180000285,{"$f":"'Elenco residui'!C295","v":0},{"$f":"'Elenco residui'!D295-'Elenco residui'!E295","v":92098.1},-25317.940000000308,0,"No",451847,-25317.940000000308]
[null,20180000286,{"$f":"'Elenco residui'!C296","v":0},{"$f":"'Elenco residui'!D296-'Elenco residui'!E296","v":460.2},-24857.740000000307,0,"No",451847,-24857.740000000307]
[null,20180000287,{"$f":"'Elenco residui'!C297","v":0},{"$f":"'Elenco residui'!D297-'Elenco residui'!E297","v":2004.87},-22852.870000000308,0,"No",451847,-22852.870000000308]
[null,20180000288,{"$f":"'Elenco residui'!C298","v":0},{"$f":"'Elenco residui'!D298-'Elenco residui'!E298","v":812.95},-22039.920000000307,0,"No",451847,-22039.920000000307]
[null,20180000289,{"$f":"'Elenco residui'!C299","v":0},{"$f":"'Elenco residui'!D299-'Elenco residui'!E299","v":1050},-20989.920000000307,0,"No",451847,-20989.920000000307]
[null,20180000290,{"$f":"'Elenco residui'!C300","v":0},{"$f":"'Elenco residui'!D300-'Elenco residui'!E300","v":178.15},-20811.770000000306,0,"No",451847,-20811.770000000306]
[null,20180000291,{"$f":"'Elenco residui'!C301","v":0},{"$f":"'Elenco residui'!D301-'Elenco residui'!E301","v":120},-20691.770000000306,0,"No",451847,-20691.770000000306]
[null,20180000292,{"$f":"'Elenco residui'!C302","v":0},{"$f":"'Elenco residui'!D302-'Elenco residui'!E302","v":131.86000000000001},-20559.910000000305,0,"No",{"$f":"$I$10","v":451847},-20559.910000000305]
[null,20180000293,{"$f":"'Elenco residui'!C303","v":0},{"$f":"'Elenco residui'!D303-'Elenco residui'!E303","v":248.6},-20311.310000000307,0,{"$f":"IF(F311=0,\"No\",\"Sì\")","v":"No"},451847,-20311.310000000307]
[null,20180000294,{"$f":"'Elenco residui'!C304","v":0},{"$f":"'Elenco residui'!D304-'Elenco residui'!E304","v":32331.67},12020.359999999691,1,"Sì",451847,-439826.64000000031]
[null,20180000295,{"$f":"'Elenco residui'!C305","v":0},{"$f":"'Elenco residui'!D305-'Elenco residui'!E305","v":121.88},-439704.7600000003,0,"No",451847,-439704.7600000003]
[null,20180000296,{"$f":"'Elenco residui'!C306","v":0},{"$f":"'Elenco residui'!D306-'Elenco residui'!E306","v":12000},-427704.7600000003,0,"No",451847,-427704.7600000003]
[null,20180000297,{"$f":"'Elenco residui'!C307","v":0},{"$f":"'Elenco residui'!D307-'Elenco residui'!E307","v":12000},-415704.7600000003,0,"No",451847,-415704.7600000003]
[null,20180000298,{"$f":"'Elenco residui'!C308","v":0},{"$f":"'Elenco residui'!D308-'Elenco residui'!E308","v":306.98},-415397.78000000032,0,"No",451847,-415397.78000000032]
[null,20180000299,{"$f":"'Elenco residui'!C309","v":0},{"$f":"'Elenco residui'!D309-'Elenco residui'!E309","v":1158.5899999999999},-414239.19000000029,0,"No",451847,-414239.19000000029]
[null,20180000300,{"$f":"'Elenco residui'!C310","v":0},{"$f":"'Elenco residui'!D310-'Elenco residui'!E310","v":5951.16},-408288.03000000032,0,"No",451847,-408288.03000000032]
[null,20180000301,{"$f":"'Elenco residui'!C311","v":0},{"$f":"'Elenco residui'!D311-'Elenco residui'!E311","v":611.16999999999996},-407676.86000000034,0,"No",451847,-407676.86000000034]
[null,20180000302,{"$f":"'Elenco residui'!C312","v":0},{"$f":"'Elenco residui'!D312-'Elenco residui'!E312","v":16551.599999999999},-391125.26000000036,0,"No",451847,-391125.26000000036]
[null,20180000303,{"$f":"'Elenco residui'!C313","v":0},{"$f":"'Elenco residui'!D313-'Elenco residui'!E313","v":10390.94},-380734.32000000036,0,"No",451847,-380734.32000000036]
[null,20180000304,{"$f":"'Elenco residui'!C314","v":0},{"$f":"'Elenco residui'!D314-'Elenco residui'!E314","v":4589.8999999999996},-376144.42000000033,0,"No",451847,-376144.42000000033]
[null,20180000305,{"$f":"'Elenco residui'!C315","v":0},{"$f":"'Elenco residui'!D315-'Elenco residui'!E315","v":17692.189999999999},-358452.23000000033,0,"No",451847,-358452.23000000033]
[null,20180000306,{"$f":"'Elenco residui'!C316","v":0},{"$f":"'Elenco residui'!D316-'Elenco residui'!E316","v":4057.79},-354394.44000000035,0,"No",451847,-354394.44000000035]
[null,20180000307,{"$f":"'Elenco residui'!C317","v":0},{"$f":"'Elenco residui'!D317-'Elenco residui'!E317","v":6086.82},-348307.62000000034,0,"No",451847,-348307.62000000034]
[null,20180000308,{"$f":"'Elenco residui'!C318","v":0},{"$f":"'Elenco residui'!D318-'Elenco residui'!E318","v":6776},-341531.62000000034,0,"No",451847,-341531.62000000034]
[null,"6.03.01.04.003","ADEGUAMENTO EDIFICI COMUNALI NORME SICUREZZA",92098.1,{"$f":"D327+I326","v":-249433.52000000034},{"$f":"IF(E327>0,ROUND(E327/H327+0.5,0),0)","v":0},"No",451847,{"$f":"E327-(F327*H327)","v":-249433.52000000034}]
[null,"9.01.02.02.001","ARROTONDAMENTO STIP. DIC.' 16.",460.2,-248973.32000000033,0,"No",451847,-248973.32000000033]
[null,"9.01.02.01.001","ritenute erariali 2016",2004.87,-246968.45000000033,0,"No",451847,-246968.45000000033]
[null,"9.02.04.01.001","DEP.CAUZ.-A-T-E-R-LOCALI VIA C. MARCIANI 22/24 UFF.I.C.I.",812.95,-246155.50000000032,0,"No",451847,-246155.50000000032]
[null,"9.02.04.01.001","DEPOSITO CAUZIONALE AL CONSORZIO ASI SANGRO ATESSA PER SMALTIMENTO ACQUE REFLUE.",1050,-245105.50000000032,0,"No",451847,-245105.50000000032]
[null,"9.02.04.01.001","IMPEGNO DI SPESA PER DEPOSITO CAUZIONALE RINNOVO NOVENNALE BANCA DATI M.C.T.C. - VEDI IMPEGNO N.995 -",178.15,-244927.35000000033,0,"No",451847,-244927.35000000033]
[null,"9.02.99.99.999","RIFERIMENTO MANDATO N. 3675/2016",120,-244807.35000000033,0,"No",451847,-244807.35000000033]
[null,"9.02.99.99.999","CONSUMO E.E. PERIODO FEB./MAR.'16 - CASA PARCHEGGIO ANGELUCCI LUIGI -",131.86000000000001,-244675.49000000034,0,"No",451847,-244675.49000000034]
[null,"9.02.99.99.999","F24 SCUOLA CIVICA DI MUSICA DA RECUPERARE",248.6,-244426.89000000033,0,"No",451847,-244426.89000000033]
[null,"9.02.99.99.999","SUMMA CORPORATION srl: PAGto CANONE LOCne MERCATO COPERTO -disposto da D'ALESSANDRO Orlando Franco dal MESE DI OTTOBRE (x mensilita' APR 2016 Rev 4751) - CAP 51800 IMP n.764-",32331.67,-212095.22000000032,0,"No",451847,-212095.22000000032]
[null,"9.02.99.99.999","spese scuola civica da recuperare 2016",121.88,-211973.34000000032,0,"No",451847,-211973.34000000032]
[null,"9.02.99.99.999","COFINANZ.REGIONE PREDISPOSIZ.PIA NO EX DISCAR.SERRE-GEOL.M.RANIER",12000,-199973.34000000032,0,"No",451847,-199973.34000000032]
[null,"9.02.99.99.999","COFINANZ.REGIONE PREDISP.PIANO EX DISCAR.SERRE -GEOL. L. ENRICO",12000,-187973.34000000032,0,"No",451847,-187973.34000000032]
[null,"9.02.99.99.999","CONCES. D'USO DI IMMOB. DI PROPRIETA' DELL'ENTE DENOMINATO \"EX SCUOLA SANTA MARIA DEI MESI\" IN FAVORE DELLA SOC. DILETTANT.CA \"PUGILISTICA NATIVIO E LE TRE CONTR.\"- CONSUMO E.E. NOV.'13 A OTT.'14 E GAS OTT.'13 A GIU.14. (E.E. LUG./AGO.'13 E. 68.57)",306.98,-187666.36000000031,0,"No",451847,-187666.36000000031]
[null,"9.02.99.99.999","RECUPERO SOMME F24 GENNAIO ERRONEAMENTE VERSATO VEDI MANDATO 6458/15 ANNULLATO E SOSTITUITO CON MAND. 6491/15.",1158.5899999999999,-186507.77000000031,0,"No",451847,-186507.77000000031]
[null,"9.02.99.99.999","SP.TRASP/CUSTODIA VEICOLI SEQUES DITTA CICCONE C./VEDI IMP.N.2807",5951.16,-180556.61000000031,0,"No",451847,-180556.61000000031]
[null,"9.02.99.99.999","RECUPERO SPESE CUSTODIA VEICOLI",611.16999999999996,-179945.44000000029,0,"No",451847,-179945.44000000029]
[null,"9.02.99.99.999","DITTA TOROSANTUCCI E BATTISTA - RECUPERO SPESE DI TRASPORTO E CUSTODIA VEICOLI SEQUESTRATI",16551.599999999999,-163393.84000000029,0,"No",451847,-163393.84000000029]
[null,"9.02.99.99.999","RECUPERO SPESE CUSTODIA VEICOLI SEQUESTRATI",10390.94,-153002.90000000029,0,"No",451847,-153002.90000000029]
[null,"9.02.99.99.999","RIMOZIONE E CUSTODIA VEICOLI SEQUESTRATI / DITTA CICCONE CORRADO - VEDI IMP. N. 665",4589.8999999999996,-148413.00000000029,0,"No",451847,-148413.00000000029]
[null,"9.02.99.99.999","SPESE DI RIMOZIONE E CUSTODIA VEICOLI - DITTA TOROSANTUCCI & BATTISTA - VEDI IMP. N.986 -",17692.189999999999,-130720.81000000029,0,"No",451847,-130720.81000000029]
[null,"9.02.99.99.999","RIMBORSO SPESE ANTUCIPATE SU CUSTODIA VEICOLI ( VEDI IMPEGNO N. 361/2012)",4057.79,-126663.0200000003,0,"No",451847,-126663.0200000003]
[null,"9.02.99.99.999","RECUPERO SPESE DI RIMOZIONE E CUSTODIA VEICOLI SEQUESTRATI / DITTA CICCONE CORRADO - VEDI IMP.N.530 -",6086.82,-120576.2000000003,0,"No",451847,-120576.2000000003]
[null,"9.02.99.99.999","SPESE DI RIMOZIONE E CUSTODIA VEICOLI SEQUESTRATI / DITTA \"TOROSANTUCCI & BATTISTA \" - VEDI IMP.N.583 -",6776,-113800.2000000003,0,"No",451847,-113800.2000000003]